{"text_format":"1","workbook":"xlsx","n_sheets":22,"sheets":["Инструкция","Титульный","Список листов","ТС цены","ТС цены (2)","ТС показатели (2)","ТС характеристики","ТС инвестиции","ТС доступ","ТС показатели","Ссылки на публикации","Проверка","REESTR_START","REESTR_ORG","REESTR_TEMP","REESTR","TEHSHEET","tech","modHyp","modChange","modButtonClick","modSubsidiary"],"not_rendered":{"charts":0,"images":6,"macros":1,"external_links":1,"defined_names":129,"comments":0,"pivot_tables":0},"unopened":[],"bounds":{"document_bytes":16777216,"sheet_cells":100000,"rows_first":2000,"rows_last":500,"rows_between":2000,"halvings":0,"cell_chars":16384,"cell_head_chars":4096},"cells_cut":0,"cells_raw":0,"read":"whole","date_system":"1900"}

{"sheet":"Инструкция","index":0,"n_rows":54,"n_cols":16,"rows_kept":54,"cut":false,"hidden":false,"merged":[[49,4,49,10],[42,2,42,3],[42,4,42,10],[43,2,43,3],[43,4,43,10],[1,15,1,16],[2,2,2,15],[4,2,4,7],[41,2,41,7],[5,2,5,7],[53,2,53,3],[53,4,53,10],[44,2,44,3],[44,4,44,10],[45,2,45,3],[45,4,45,10],[46,2,46,3],[46,4,46,10],[48,2,48,7],[49,2,49,3],[50,2,50,3],[50,4,50,10],[51,2,51,3],[51,4,51,10],[52,2,52,3],[52,4,52,10]]}
[]
[null,null,null,null,null,null,null,null,null,null,null,null,null,null,null,{"$f":"\"Версия \" & GetVersion()","v":"Версия 3.0"}]
[null,null,"Инструкция по заполнению шаблона"]
[]
[null,null,"Субъект РФ"]
[null,null,"Ставропольский край"]
[]
[]
[]
[]
[]
[]
[]
[]
[]
{"$rows_left_out":40}
{"sheet":"Титульный","index":1,"n_rows":35,"n_cols":8,"rows_kept":35,"cut":false,"hidden":false,"merged":[[31,4,34,4],[25,4,25,5],[27,4,28,4],[29,4,30,4],[26,4,26,5],[22,4,23,4],[19,5,19,6],[20,5,20,6],[2,6,2,7],[3,4,3,6],[5,4,5,5],[6,4,6,5],[12,5,12,6],[14,5,14,6]]}
[{"$f":"region_name","v":"Ставропольский край"},{"$f":"IF(god=\"\",\"Не определено\",god)","v":"2012"},{"$f":"org&\"_INN:\"&inn&\"_KPP:\"&kpp","v":"Открытое акционерное общество \"Ставропольсахар\"_INN:2607012219_KPP:260701001"}]
[{"$f":"IF(org=\"\",\"Не определено\",org)","v":"Открытое акционерное общество \"Ставропольсахар\""},{"$f":"IF(inn=\"\",\"Не определено\",inn)","v":"2607012219"}]
[{"$f":"IF(mo=\"\",\"Не определено\",mo)","v":"Город Изобильный"},{"$f":"IF(oktmo=\"\",\"Не определено\",oktmo)","v":"07620101"},null,null,null,null,{"$f":"version","v":"Версия 3.0"}]
[{"$f":"IF(fil=\"\",\"Не определено\",fil)","v":"Не определено"},{"$f":"IF(kpp=\"\",\"Не определено\",kpp)","v":"260701001"},null,null,"Показатели подлежащие раскрытию в сфере теплоснабжения и сфере оказания услуг по передаче тепловой энергии"]
[]
[null,null,null,null,"Субъект РФ"]
[null,null,null,null,"Ставропольский край"]
[]
[null,null,null,null,"Отчетный год:","2012","Отчетный квартал:","Год"]
[]
["L0","Признак филиала",null,null,"Является ли данное юридическое лицо подразделением(филиалом) другой организации","нет","Тип предоставляемых данных:","ПЛАН"]
[132]
[null,null,null,null,"Наименование ??? организации","Открытое акционерное общество \"Ставропольсахар\""]
[]
[null,null,null,null,"Наименование ПОДРАЗДЕЛЕНИЯ",null,null,"(заполняется, \nесли в ячейке \"F11\" - \"да\")"]
{"$rows_left_out":21}
{"sheet":"Список листов","index":2,"n_rows":9,"n_cols":4,"rows_kept":9,"cut":false,"hidden":false,"merged":[]}
[]
[null,"Лист","Заголовок листа","Ссылка"]
[null,"ТС цены",{"$f":"'ТС цены'!$E$10","v":"Информация о ценах (тарифах) на регулируемые товары и услуги и надбавках к этим ценам (тарифам)"},"Перейти на лист"]
[null,"ТС цены (2)",{"$f":"'ТС цены (2)'!E10","v":"Информация о ценах (тарифах) на регулируемые товары и услуги и надбавках к этим ценам (тарифам)"},"Перейти на лист"]
[null,"ТС характеристики",{"$f":"'ТС характеристики'!$E$10","v":"Информация об основных потребительских характеристиках регулируемых товаров и услуг регулируемых организаций и их соответствии государственным и иным утвержденным стандартам качества"},"Перейти на лист"]
[null,"ТС инвестиции",{"$f":"'ТС инвестиции'!$E$10","v":"Информация об инвестиционных программах и отчетах об их реализации"},"Перейти на лист"]
[null,"ТС доступ",{"$f":"'ТС доступ'!$E$10","v":"Информация о наличии (отсутствии) технической возможности доступа к регулируемым товарам и услугам регулируемых организаций, а также о регистрации и ходе реализации заявок на подключение к системе теплоснабжения"},"Перейти на лист"]
[null,"ТС показатели",{"$f":"'ТС показатели'!$E$10","v":"Информация об основных показателях финансово-хозяйственной деятельности регулируемых организаций, включая структуру основных производственных затрат (в части регулируемой деятельности)"},"Перейти на лист"]
[null,"Ссылки на публикации",{"$f":"'Ссылки на публикации'!E10","v":"Ссылки на публикации в других источниках"},"Перейти на лист"]

{"sheet":"ТС цены","index":3,"n_rows":32,"n_cols":24,"rows_kept":32,"cut":false,"hidden":false,"merged":[[15,5,16,5],[27,5,28,5],[29,5,30,5],[17,5,18,5],[19,5,20,5],[21,5,22,5],[23,5,24,5],[25,5,26,5],[12,13,13,13],[12,14,12,15],[11,7,11,9],[12,8,12,9],[11,5,13,6],[11,22,13,22],[11,23,13,23],[9,4,9,23],[14,5,14,6],[11,4,13,4],[11,19,13,19],[11,20,13,20],[11,21,13,21],[11,10,11,12],[11,13,11,15],[11,16,11,18],[12,7,13,7],[12,10,13,10],[12,16,13,16],[12,17,12,18],[12,11,12,12]]}
[]
[]
[]
[]
[]
[]
[]
[]
[null,null,null,null,null,"Список листов"]
[null,null,null,null,"Информация о ценах (тарифах) на регулируемые товары и услуги и надбавках к этим ценам (тарифам)"]
[]
[null,null,null,null,"№ п/п","Тариф на тепловую энергию / дифференциация по видам теплоносителя",null,"Организации-перепродавцы",null,null,"Бюджетные потребители",null,null,"Население",null,null,"Прочие",null,null,"Дата ввода","Срок действия (если установлен)","Постановление (от XX.XX.XXXX №)","Наименование регулирующего органа, принявшего решение об утверждении цен","Источник официального опубликования"]
[null,null,null,null,null,null,null,"Одноставочный тариф, руб./Гкал","Двухставочный тариф",null,"Одноставочный тариф, руб./Гкал","Двухставочный тариф",null,"Одноставочный тариф, руб./Гкал","Двухставочный тариф",null,"Одноставочный тариф, руб./Гкал","Двухставочный тариф"]
[null,null,null,null,null,null,null,null,"ставка за энергию руб./Гкал","ставка за мощность тыс.руб.в месяц/Гкал/ч",null,"ставка за энергию руб./Гкал","ставка за мощность тыс.руб.в месяц/Гкал/ч",null,"ставка за энергию руб./Гкал","ставка за мощность тыс.руб.в месяц/Гкал/ч",null,"ставка за энергию руб./Гкал","ставка за мощность тыс.руб.в месяц/Гкал/ч"]
[null,null,null,null,1,2,null,3,4,5,6,7,8,9,10,11,12,13,14,15,16,17,18,19]
{"$rows_left_out":18}
{"sheet":"ТС цены (2)","index":4,"n_rows":22,"n_cols":11,"rows_kept":22,"cut":false,"hidden":false,"merged":[[9,4,9,7]]}
[]
[null,null,null,"Удалить"]
[]
[]
[]
[]
[]
[]
[null,null,null,null,null,"Список листов"]
[null,null,null,null,"Информация о ценах (тарифах) на регулируемые товары и услуги и надбавках к этим ценам (тарифам)"]
[]
[null,null,null,null,"№ п/п","Наименование показателя","Единица измерения","Значение"]
[null,null,null,null,1,2,3,4]
[null,null,null,null,"1","Утвержденная надбавка к ценам (тарифам) на тепловую энергию для потребителей","руб./Гкал",0,null,null,{"$f":"SUM(K15:K17)","v":3}]
[null,null,null,null,"1.1","Утвержденная надбавка к ценам (тарифам) на тепловую энергию для населения","руб./Гкал",0,null,null,{"$f":"IF(H15=\"\",0,1)","v":1}]
{"$rows_left_out":8}
{"sheet":"ТС показатели (2)","index":5,"n_rows":65,"n_cols":10,"rows_kept":65,"cut":false,"hidden":false,"merged":[[61,5,61,6],[62,5,62,6],[63,5,63,6],[64,5,64,6],[55,5,55,6],[56,5,56,6],[57,5,57,6],[58,5,58,6],[59,5,59,6],[60,5,60,6],[54,5,54,6],[43,5,43,6],[44,5,44,6],[45,5,45,6],[46,5,46,6],[47,5,47,6],[48,5,48,6],[49,5,49,6],[50,5,50,6],[51,5,51,6],[52,5,52,6],[53,5,53,6],[42,5,42,6],[31,5,31,6],[32,5,32,6],[33,5,33,6],[34,5,34,6],[35,5,35,6],[36,5,36,6],[37,5,37,6],[38,5,38,6],[39,5,39,6],[40,5,40,6],[41,5,41,6],[30,5,30,6],[16,5,16,6],[17,5,17,6],[18,4,21,4],[18,5,21,5],[23,5,23,6],[24,5,24,6],[25,5,25,6],[26,5,26,6],[27,5,27,6],[28,5,28,6],[29,5,29,6],[15,5,15,6],[9,4,9,8],[11,5,11,6],[12,5,12,6],[13,5,13,6],[14,5,14,6]]}
[]
[]
[]
[]
[]
[]
[]
[]
[null,null,null,null,null,"Список листов"]
[null,null,null,null,"Информация об основных показателях финансово-хозяйственной деятельности регулируемых организаций, включая структуру основных производственных затрат (в части регулируемой деятельности)"]
[]
[null,null,null,null,"№ п/п","Наименование показателя",null,"Единица измерения","Значение"]
[null,null,null,null,1,{"$f":"E13+1","v":2},null,{"$f":"F13+1","v":3},{"$f":"H13+1","v":4}]
[null,null,null,null,1,"Вид регулируемой деятельности (производство, передача и сбыт тепловой энергии)",null,"x","производство комбинированная выработка"]
[null,null,null,null,2,"Выручка от регулируемой деятельности",null,"тыс.руб.",124161.31]
{"$rows_left_out":51}
{"sheet":"ТС характеристики","index":6,"n_rows":17,"n_cols":7,"rows_kept":17,"cut":false,"hidden":false,"merged":[[9,4,9,6]]}
[]
[]
[]
[]
[]
[]
[]
[]
[null,null,null,null,null,"Список листов"]
[null,null,null,null,"Информация об основных потребительских характеристиках регулируемых товаров и услуг регулируемых организаций и их соответствии государственным и иным утвержденным стандартам качества"]
[]
[null,null,null,null,"№ п/п","Наименование показателя","Значение"]
[null,null,null,null,1,{"$f":"E13+1","v":2},{"$f":"F13+1","v":3}]
[null,null,null,null,1,"Количество аварий на системах теплоснабжения (единиц на км)",0]
[null,null,null,null,2,"Количество часов (суммарно за календарный год), превышающих допустимую продолжительность перерыва подачи тепловой энергии в отопительный период",0]
{"$rows_left_out":3}
{"sheet":"ТС инвестиции","index":7,"n_rows":53,"n_cols":12,"rows_kept":53,"cut":false,"hidden":false,"merged":[[9,4,9,6]]}
[]
[]
[]
[]
[]
[]
[]
[]
[null,null,null,null,null,"Список листов"]
[null,null,null,null,"Информация об инвестиционных программах и отчетах об их реализации"]
[]
[null,null,null,null,"№ п/п","Наименование показателя","Значение","Плановые значения"]
[null,null,null,null,1,{"$f":"E13+1","v":2},{"$f":"F13+1","v":3},{"$f":"G13+1","v":4}]
[null,null,null,null,1,"Наименование инвестиционной программы","0","х",null,"Введите название мероприятия",null,"Добавить мероприятие"]
[null,null,null,null,2,"Цель инвестиционной программы","0","х",null,"х"]
{"$rows_left_out":39}
{"sheet":"ТС доступ","index":8,"n_rows":21,"n_cols":7,"rows_kept":21,"cut":false,"hidden":false,"merged":[[9,4,9,6]]}
[]
[]
[]
[]
[]
[]
[]
[]
[null,null,null,null,null,"Список листов"]
[null,null,null,null,"Информация о наличии (отсутствии) технической возможности доступа к регулируемым товарам и услугам регулируемых организаций, а также о регистрации и ходе реализации заявок на подключение к системе теплоснабжения"]
[]
[null,null,null,null,"№ п/п","Наименование показателя","Значение"]
[null,null,null,null,1,{"$f":"E13+1","v":2},{"$f":"F13+1","v":3}]
[null,null,null,null,1,"Количество поданных заявок на подключение к системе теплоснабжения",0]
[null,null,null,null,"1.1","Количество зарегистрированных заявок на подключение к системе теплоснабжения (если отличается от количества поданных) ",0]
{"$rows_left_out":7}
{"sheet":"ТС показатели","index":9,"n_rows":65,"n_cols":10,"rows_kept":65,"cut":false,"hidden":false,"merged":[[26,5,26,6],[9,4,9,8],[18,4,21,4],[18,5,21,5],[13,5,13,6],[14,5,14,6],[15,5,15,6],[16,5,16,6],[17,5,17,6],[12,5,12,6],[11,5,11,6],[23,5,23,6],[24,5,24,6],[25,5,25,6],[35,5,35,6],[27,5,27,6],[30,5,30,6],[31,5,31,6],[32,5,32,6],[28,5,28,6],[29,5,29,6],[33,5,33,6],[34,5,34,6],[39,5,39,6],[36,5,36,6],[37,5,37,6],[38,5,38,6],[41,5,41,6],[40,5,40,6],[64,5,64,6],[58,5,58,6],[59,5,59,6],[60,5,60,6],[61,5,61,6],[63,5,63,6],[62,5,62,6],[51,5,51,6],[48,5,48,6],[42,5,42,6],[57,5,57,6],[54,5,54,6],[47,5,47,6],[49,5,49,6],[50,5,50,6],[53,5,53,6],[55,5,55,6],[56,5,56,6],[52,5,52,6],[46,5,46,6],[43,5,43,6],[45,5,45,6],[44,5,44,6]]}
[]
[]
[]
[]
[]
[]
[]
[]
[null,null,null,null,null,"Список листов"]
[null,null,null,null,"Информация об основных показателях финансово-хозяйственной деятельности регулируемых организаций, включая структуру основных производственных затрат (в части регулируемой деятельности)"]
[]
[null,null,null,null,"№ п/п","Наименование показателя",null,"Единица измерения","Значение"]
[null,null,null,null,1,{"$f":"E13+1","v":2},null,{"$f":"F13+1","v":3},{"$f":"H13+1","v":4}]
[null,null,null,null,1,"Вид регулируемой деятельности (производство, передача и сбыт тепловой энергии)",null,"x"]
[null,null,null,null,2,"Выручка от регулируемой деятельности",null,"тыс.руб."]
{"$rows_left_out":51}
{"sheet":"Ссылки на публикации","index":10,"n_rows":28,"n_cols":7,"rows_kept":28,"cut":false,"hidden":false,"merged":[[26,4,26,6],[9,4,9,6],[11,4,11,6],[27,4,27,6]]}
[]
[]
[]
[]
[]
[]
[]
[]
[null,null,null,null,null,"Список листов"]
[null,null,null,null,"Ссылки на публикации в других источниках"]
[]
[null,null,null,null,"Условия публичных договоров поставок тепловой энергии, оказания услуг в сфере теплоснабжения, в том числе договоров на подключение к системе теплоснабжения и информация о порядке выполнения мероприятий, связанных с подключением"]
[null,null,null,null,"№ п/п","Содержание пункта","Ссылка на материалы"]
[null,null,null,null,1,{"$f":"E14+1","v":2},3]
[null,null,null,null,1,"Форма заявки на подключение к системе."]
{"$rows_left_out":14}
{"sheet":"Проверка","index":11,"n_rows":1,"n_cols":3,"rows_kept":1,"cut":false,"hidden":false,"merged":[]}
["Ссылка","Причина","Статус ошибки"]

{"sheet":"REESTR_START","index":12,"n_rows":0,"n_cols":0,"rows_kept":0,"cut":false,"hidden":true,"merged":[]}

{"sheet":"REESTR_ORG","index":13,"n_rows":71,"n_cols":8,"rows_kept":71,"cut":false,"hidden":true,"merged":[]}
[null,"МР","МО","МО ОКТМО","ОРГАНИЗАЦИЯ","ИНН","КПП","ВИД ДЕЯТЕЛЬНОСТИ"]
[1,"Александровский муниципальный район","Александровский сельсовет","07602402","МУП Александровского муниципального района Ставропольского края \"ЖКХ\"","2601004596","260101001","производство (некомбинированная выработка)+передача+сбыт"]
[2,"Андроповский муниципальный район","Солуно-Дмитриевский сельсовет","07632416","Общество с ограниченной ответственностью \"Кока-кола ЭйчБиСи ЕВРАЗИЯ\" филиал в селе Солуно-Дмитриевском","2603006800","260301001","производство (некомбинированная выработка)+передача+сбыт"]
[3,"Апанасенковский муниципальный район","Село Дивное","07605419","Муниципальное унитарное предприятие \"Жилищно-коммунальногое хозяйство\" Апанасенковского муниципального района Ставропольского края","2602004366","260201001","производство (некомбинированная выработка)+передача+сбыт"]
[4,"Арзгирский муниципальный район","Арзгирский сельсовет","07607402","Муниципальное унитарное предприятие \"Коммунальное хозяйство\" Арзгирского муниципального района Ставропольского края","2604000247","260401001","производство (некомбинированная выработка)+передача+сбыт"]
[5,"ГО Ставропольского края","Город Буденновск","07702000","Федеральное государственное учреждение \"Буденновская квартирно-эксплуатационная часть района\" Министерство обороны Российской Федерации","2624032053","262401001","производство (некомбинированная выработка)+передача+сбыт"]
[6,"ГО Ставропольского края","Город Георгиевск","07707000","Георгиевское муниципальное унитарное предприятие \"Теплосеть\"","2625002189","262501001","производство (некомбинированная выработка)+передача+сбыт"]
[7,"ГО Ставропольского края","Город Георгиевск","07707000","Общество с ограниченной ответственностью \"Георгиевское производственное предприятие \"Кавказ\"","2625023333","262501001","производство (некомбинированная выработка)+передача+сбыт"]
[8,"ГО Ставропольского края","Город Георгиевск","07707000","Открытое акционерное общество \"Хлебокомбинат \"Георгиевский\"","2625012571","262501001","производство (некомбинированная выработка)+передача+сбыт"]
[9,"ГО Ставропольского края","Город Лермонтов","07718000","ЗАО \"Южная энергетическая компания\" филиал в г. Лермонтов Ставропольского края","7704262319","262902001","производство комбинированная выработка"]
[10,"ГО Ставропольского края","Город Лермонтов","07718000","Муниципальное унитарное предприятие \"Лермонтовское городское газовое хозяйство\"","2629005046","262901001","производство (некомбинированная выработка)+сбыт"]
[11,"ГО Ставропольского края","Город Невинномысск","07724000","Закрытое акционерное общество \"Невинномысский маслоэкстракционный завод\"","2631024889","263101001","производство (некомбинированная выработка)+передача+сбыт"]
[12,"ГО Ставропольского края","Город Невинномысск","07724000","Общество с ограниченной ответственностью \"Предприятие им. И.Лапина\"","2631037790","263101001","производство (некомбинированная выработка)+передача+сбыт"]
[13,"ГО Ставропольского края","Город Невинномысск","07724000","Открытое акционерное общество \"Квант-Энергия\"","2631002155","263101001","производство (некомбинированная выработка)+сбыт"]
[14,"ГО Ставропольского края","Город Невинномысск","07724000","Открытое акционерное общество \"Невинномысский Азот\"","2631015563","263101001","производство (некомбинированная выработка)+передача+сбыт"]
{"$rows_left_out":57}
{"sheet":"REESTR_TEMP","index":14,"n_rows":1,"n_cols":8,"rows_kept":1,"cut":false,"hidden":true,"merged":[]}
[null,"МР","МО","МО ОКТМО","ОРГАНИЗАЦИЯ","ИНН","КПП","ВИД ДЕЯТЕЛЬНОСТИ"]

{"sheet":"REESTR","index":15,"n_rows":336,"n_cols":5,"rows_kept":336,"cut":false,"hidden":true,"merged":[]}
["МО","МР","МР_ОКТМО"]
["Александровский муниципальный район","Александровский муниципальный район","07602000","Александровский муниципальный район","MO_LIST_2"]
["Александровский муниципальный район","Александровский сельсовет","07602402","Андроповский муниципальный район","MO_LIST_3"]
["Александровский муниципальный район","Калиновский сельсовет","07602407","Апанасенковский муниципальный район","MO_LIST_4"]
["Александровский муниципальный район","Круглолесский сельсовет","07602410","Арзгирский муниципальный район","MO_LIST_5"]
["Александровский муниципальный район","Новокавказский сельсовет","07602413","Благодарненский муниципальный район","MO_LIST_6"]
["Александровский муниципальный район","Саблинский сельсовет","07602416","Буденновский муниципальный район","MO_LIST_7"]
["Александровский муниципальный район","Село Грушевское","07602404","ГО Ростовская область","MO_LIST_8"]
["Александровский муниципальный район","Село Северное","07602419","ГО Ставропольского края","MO_LIST_9"]
["Александровский муниципальный район","Средненский сельсовет","07602422","Георгиевский муниципальный район","MO_LIST_10"]
["Андроповский муниципальный район","Андроповский муниципальный район","07632000","Грачевский муниципальный район","MO_LIST_11"]
["Андроповский муниципальный район","Водораздельный сельсовет","07632402","Изобильненский муниципальный район","MO_LIST_12"]
["Андроповский муниципальный район","Казинский сельсовет","07632406","Ипатовский муниципальный район","MO_LIST_13"]
["Андроповский муниципальный район","Красноярский сельсовет","07632407","Кировский муниципальный район","MO_LIST_14"]
["Андроповский муниципальный район","Крымгиреевский сельсовет","07632408","Кочубеевский муниципальный район","MO_LIST_15"]
{"$rows_left_out":322}
{"sheet":"TEHSHEET","index":16,"n_rows":84,"n_cols":4,"rows_kept":84,"cut":false,"hidden":true,"merged":[]}
["Алтайский край"]
["Амурская область","logical",null,"year_range"]
["Архангельская область","да",null,"2007"]
["Астраханская область","нет",null,"2008"]
["Белгородская область",null,null,"2009"]
["Брянская область",null,null,"2010"]
["Владимирская область",null,null,"2011"]
["Волгоградская область",null,null,"2012"]
["Вологодская область",null,null,"2013"]
["Воронежская область",null,null,"2014"]
["г. Москва",null,null,"2015"]
["г.Байконур",null,null,"2016"]
["г.Санкт-Петербург",null,null,"2017"]
["Еврейская автономная область",null,null,"2018"]
["Забайкальский край",null,null,"2019"]
{"$rows_left_out":70}
{"sheet":"tech","index":17,"n_rows":51,"n_cols":10,"rows_kept":51,"cut":false,"hidden":true,"merged":[[2,4,5,4],[2,5,5,5]]}
[]
[]
[null,null,null,null,null,null,"Стоимость","тыс.руб.",null,"Удалить"]
[null,null,null,null,null,null,"Объем",{"$f":"IF(J4,\"\",J5)","v":""},null,{"$f":"ISNA(J5)","v":true}]
[null,null,null,null,null,null,"Стоимость 1й единицы объема с учетом доставки (транспортировки)","тыс.руб.",{"$f":"IF(I4=\"\",0,IF(I4=0,0,I3/I4))","v":0},{"$f":"INDEX(tech!G$24:G$51,MATCH(F3,tech!F$24:F$51,0))","v":{"$error":"#N/A"}}]
[null,null,null,null,null,null,"Способ приобретения","x"]
[]
[]
[]
[]
[]
["et_price1_1"]
[]
[null,null,null,"Удалить теплоноситель"]
[]
{"$rows_left_out":37}
{"sheet":"modHyp","index":18,"n_rows":0,"n_cols":0,"rows_kept":0,"cut":false,"hidden":true,"merged":[]}

{"sheet":"modChange","index":19,"n_rows":0,"n_cols":0,"rows_kept":0,"cut":false,"hidden":true,"merged":[]}

{"sheet":"modButtonClick","index":20,"n_rows":0,"n_cols":0,"rows_kept":0,"cut":false,"hidden":true,"merged":[]}

{"sheet":"modSubsidiary","index":21,"n_rows":0,"n_cols":0,"rows_kept":0,"cut":false,"hidden":true,"merged":[]}